Reaction Details
TargetTranslocator protein
LigandBDBM50390855
Substrate/Competitorn/a
Meas. Tech.ChEMBL_835804 (CHEMBL2071915)
Ki 3.77±n/a nM
Citation Wadsworth, HJones, PAChau, WFDurrant, CMorisson-Iveson, VPassmore, JO'Shea, DWynn, DKhan, IBlack, AAvory, MTrigg, W Exploration of the structure-activity relationship of the diaryl anilide class of ligands for translocator protein--potential novel positron emitting tomography imaging agents. Bioorg Med Chem Lett22:5795-800 (2012) 
 
Translocator protein
Name:Translocator protein
Type:Mitochondrion membrane protein
Mol. Mass.:18945.84
Organism:Rattus norvegicus (rat)
Description:Competitive binding experiments were performed on rat kidney mitochondrial membranes.
Residue:169
BDBM50390855
NameBDBM50390855
Synonyms:CHEMBL2070802
TypeSmall organic molecule
Emp. Form.C21H19FN2O3
Mol. Mass.366.3856
SMILESCOc1ncccc1CN(C(=O)CF)c1ccccc1Oc1ccccc1