Reaction Details
TargetTranslocator protein
LigandBDBM50390865
Substrate/Competitorn/a
Meas. Tech.ChEMBL_835804 (CHEMBL2071915)
Ki 2.66±n/a nM
Citation Wadsworth, HJones, PAChau, WFDurrant, CMorisson-Iveson, VPassmore, JO'Shea, DWynn, DKhan, IBlack, AAvory, MTrigg, W Exploration of the structure-activity relationship of the diaryl anilide class of ligands for translocator protein--potential novel positron emitting tomography imaging agents. Bioorg Med Chem Lett22:5795-800 (2012) 
 
Translocator protein
Name:Translocator protein
Type:Mitochondrion membrane protein
Mol. Mass.:18945.84
Organism:Rattus norvegicus (rat)
Description:Competitive binding experiments were performed on rat kidney mitochondrial membranes.
Residue:169
BDBM50390865
NameBDBM50390865
Synonyms:CHEMBL2070812
TypeSmall organic molecule
Emp. Form.C25H24FNO3
Mol. Mass.405.4614
SMILESCC1(C)Cc2cccc(CN(C(=O)CF)c3ccccc3Oc3ccccc3)c2O1