Reaction Details
TargetLysine-specific demethylase 4C
LigandBDBM50390932
Substrate/Competitorn/a
Meas. Tech.ChEMBL_835846 (CHEMBL2071957)
Ki>200000±n/a nM
Citation Leurs, UClausen, RPKristensen, JLLohse, B Inhibitor scaffold for the histone lysine demethylase KDM4C (JMJD2C). Bioorg Med Chem Lett22:5811-3 (2012) 
 
Lysine-specific demethylase 4C
Name:Lysine-specific demethylase 4C
Type:Protein
Mol. Mass.:119979.01
Organism:Homo sapiens (Human)
Description:Q9H3R0
Residue:1056
BDBM50390932
NameBDBM50390932
Synonyms:CHEMBL2071016
TypeSmall organic molecule
Emp. Form.C6H8N2O2
Mol. Mass.140.1399
SMILESCc1c(cnn1C)C(O)=O