Reaction Details
TargetLysine-specific demethylase 4C
LigandBDBM50390943
Substrate/Competitorn/a
Meas. Tech.ChEMBL_835846 (CHEMBL2071957)
Ki>200000±n/a nM
Citation Leurs, UClausen, RPKristensen, JLLohse, B Inhibitor scaffold for the histone lysine demethylase KDM4C (JMJD2C). Bioorg Med Chem Lett22:5811-3 (2012) 
 
Lysine-specific demethylase 4C
Name:Lysine-specific demethylase 4C
Type:Protein
Mol. Mass.:119979.01
Organism:Homo sapiens (Human)
Description:Q9H3R0
Residue:1056
BDBM50390943
NameBDBM50390943
Synonyms:CHEMBL2071030
TypeSmall organic molecule
Emp. Form.C11H11N3O3
Mol. Mass.233.2233
SMILESCOC(=O)c1n[nH]n(Cc2ccccc2)c1=O