Reaction Details
TargetLysine-specific demethylase 4C
LigandBDBM50390956
Substrate/Competitorn/a
Meas. Tech.ChEMBL_835846 (CHEMBL2071957)
Ki>200000±n/a nM
Citation Leurs, UClausen, RPKristensen, JLLohse, B Inhibitor scaffold for the histone lysine demethylase KDM4C (JMJD2C). Bioorg Med Chem Lett22:5811-3 (2012) 
 
Lysine-specific demethylase 4C
Name:Lysine-specific demethylase 4C
Type:Protein
Mol. Mass.:119979.01
Organism:Homo sapiens (Human)
Description:Q9H3R0
Residue:1056
BDBM50390956
NameBDBM50390956
Synonyms:CHEMBL2071155
TypeSmall organic molecule
Emp. Form.C8H5Cl2N3O
Mol. Mass.230.051
SMILES[O-][n+]1nn(c(Cl)c1Cl)-c1ccccc1