Reaction Details
TargetLysine-specific demethylase 4C
LigandBDBM50390929
Substrate/Competitorn/a
Meas. Tech.ChEMBL_835846 (CHEMBL2071957)
IC50 30000±n/a nM
Citation Leurs, UClausen, RPKristensen, JLLohse, B Inhibitor scaffold for the histone lysine demethylase KDM4C (JMJD2C). Bioorg Med Chem Lett22:5811-3 (2012) 
 
Lysine-specific demethylase 4C
Name:Lysine-specific demethylase 4C
Type:Protein
Mol. Mass.:119979.01
Organism:Homo sapiens (Human)
Description:Q9H3R0
Residue:1056
BDBM50390929
NameBDBM50390929
Synonyms:CHEMBL2071013
TypeSmall organic molecule
Emp. Form.C7H8N2O5
Mol. Mass.200.1488
SMILESCOC(=O)c1n[nH]c(C(=O)OC)c1O