Reaction Details
TargetSodium/bile acid cotransporter
LigandBDBM50375594
Substrate/Competitorn/a
Meas. Tech.ChEMBL_838517 (CHEMBL2078145)
IC50 5300±n/a nM
Citation Kim, RBLeake, BCvetkovic, MRoden, MMNadeau, JWalubo, AWilkinson, GR Modulation by drugs of human hepatic sodium-dependent bile acid transporter (sodium taurocholate cotransporting polypeptide) activity. J Pharmacol Exp Ther291:1204-9 (1999) Sodium/bile acid cotransporter
Name:Sodium/bile acid cotransporter
Type:PROTEIN
Mol. Mass.:38131.81
Organism:Homo sapiens (Human)
Description:ChEMBL_838517
Residue:349
BDBM50375594
NameBDBM50375594
Synonyms:TAUROCHOLATE
TypeSmall organic molecule
Emp. Form.C26H45NO7S
Mol. Mass.515.703
SMILESC[C@H](CCC(=O)NCCS(O)(=O)=O)[C@H]1CC[C@H]2[C@@H]3[C@H](O)C[C@@H]4C[C@H](O)CC[C@]4(C)[C@H]3C[C@H](O)[C@]12C