Reaction Details
TargetSodium/bile acid cotransporter
LigandBDBM31768
Substrate/Competitorn/a
Meas. Tech.ChEMBL_838517 (CHEMBL2078145)
IC50 264000±n/a nM
Citation Kim, RBLeake, BCvetkovic, MRoden, MMNadeau, JWalubo, AWilkinson, GR Modulation by drugs of human hepatic sodium-dependent bile acid transporter (sodium taurocholate cotransporting polypeptide) activity. J Pharmacol Exp Ther291:1204-9 (1999) Sodium/bile acid cotransporter
Name:Sodium/bile acid cotransporter
Type:PROTEIN
Mol. Mass.:38131.81
Organism:Homo sapiens (Human)
Description:ChEMBL_838517
Residue:349
BDBM31768
NameBDBM31768
Synonyms:CHEMBL295698 Nizoral | Panfungol
TypeSmall organic molecule
Emp. Form.C26H28Cl2N4O4
Mol. Mass.531.431
SMILESCC(=O)N1CCN(CC1)c1ccc(OC[C@@H]2CO[C@](Cn3ccnc3)(O2)c2ccc(Cl)cc2Cl)cc1