Reaction Details
TargetATP-binding cassette sub-family C member 2
LigandBDBM50329850
Substrate/Competitorn/a
Meas. Tech.ChEMBL_836182 (CHEMBL2075081)
Ki 84100±n/a nM
Citation Akhteruzzaman, SKato, YHisaka, ASugiyama, Y Primary active transport of peptidic endothelin antagonists by rat hepatic canalicular membrane. J Pharmacol Exp Ther288:575-81 (1999) ATP-binding cassette sub-family C member 2
Name:ATP-binding cassette sub-family C member 2
Type:PROTEIN
Mol. Mass.:173415.22
Organism:Rattus norvegicus
Description:ChEMBL_1455464
Residue:1541
BDBM50329850
NameBDBM50329850
Synonyms:(R)-3-Amino-4-[(S)-2-((R)-1-{(S)-1-[(R)-1-(1H-indol-3-ylmethyl)-2-oxo-ethylcarbamoyl]-3-methyl-but-3-enylcarbamoyl}-2-methyl-propylcarbamoyl)-pyrrolidin-1-yl]-4-oxo-butyric acid CHEMBL1269102 [(5R,8R,11S,14R,16aR)-8-(1H-Indol-3-ylmethyl)-11-isobutyl-14-isopropyl-4,7,10,13,16-pentaoxo-hexadecahydro-3a,6,9,12,15-pentaaza-cyclopentacyclopentadecen-5-yl]-acetic acid [8-(1H-Indol-3-ylmethyl)-11-isobutyl-14-isopropyl-4,7,10,13,16-pentaoxo-hexadecahydro-3a,6,9,12,15-pentaaza-cyclopentacyclopentadecen-5-yl]-acetic acid
TypeSmall organic molecule
Emp. Form.C31H42N6O7
Mol. Mass.610.7012
SMILESCC(C)C[C@@H]1NC(=O)[C@H](NC(=O)[C@@H]2CCCN2C(=O)[C@H](CC(O)=O)NC(=O)[C@@H](Cc2c[nH]c3ccccc23)NC1=O)C(C)C