Reaction Details
TargetSolute carrier family 22 member 6
LigandBDBM50270009
Substrate/Competitorn/a
Meas. Tech.ChEMBL_835925 (CHEMBL2077063)
Ki 500000±n/a nM
Citation Jariyawat, SSekine, TTakeda, MApiwattanakul, NKanai, YSophasan, SEndou, H The interaction and transport of beta-lactam antibiotics with the cloned rat renal organic anion transporter 1. J Pharmacol Exp Ther290:672-7 (1999) Solute carrier family 22 member 6
Name:Solute carrier family 22 member 6
Type:PROTEIN
Mol. Mass.:60784.17
Organism:Rattus norvegicus
Description:ChEMBL_838479
Residue:551
BDBM50270009
NameBDBM50270009
Synonyms:(2S,5R,6R)-6-{[carboxylato(phenyl)acetyl]amino}-3,3-dimethyl-7-oxo-4-thia-1-azabicyclo[3.2.0]heptane-2-carboxylate CARBENICILLIN carbenicillin(2-)
TypeSmall organic molecule
Emp. Form.C17H16N2O6S
Mol. Mass.376.385
SMILESCC1(C)S[C@@H]2[C@H](NC(=O)C(C([O-])=O)c3ccccc3)C(=O)N2[C@H]1C([O-])=O