Reaction Details
TargetSolute carrier organic anion transporter family member 1B3
LigandBDBM50370232
Substrate/Competitorn/a
Meas. Tech.ChEMBL_836785 (CHEMBL2075310)
Ki 5000±n/a nM
Citation Vavricka, SRVan Montfoort, JHa, HRMeier, PJFattinger, K Interactions of rifamycin SV and rifampicin with organic anion uptake systems of human liver. Hepatology36:164-72 (2002) 
 
Solute carrier organic anion transporter family member 1B3
Name:Solute carrier organic anion transporter family member 1B3
Type:Protein
Mol. Mass.:77425.75
Organism:Homo sapiens (Human)
Description:Q9NPD5
Residue:702
BDBM50370232
NameBDBM50370232
Synonyms:BA-41166E RIFAMPIN Rifampicin
TypeSmall organic molecule
Emp. Form.C43H58N4O12
Mol. Mass.822.9402
SMILESCO[C@H]1\C=C\O[C@@]2(C)Oc3c(C2=O)c2c(O)c(\C=N\N4CCN(C)CC4)c(NC(=O)\C(C)=C/C=C/[C@H](C)[C@H](O)[C@@H](C)[C@@H](O)[C@@H](C)[C@H](OC(C)=O)[C@@H]1C)c(O)c2c(O)c3C