Reaction Details
TargetABC-type glutathione-S-conjugate transporter
LigandBDBM18050
Substrate/Competitorn/a
Meas. Tech.ChEMBL_836116 (CHEMBL2077552)
Ki 1200000±n/a nM
Citation Akita, HSuzuki, HHirohashi, TTakikawa, HSugiyama, Y Transport activity of human MRP3 expressed in Sf9 cells: comparative studies with rat MRP3. Pharm Res19:34-41 (2002) ABC-type glutathione-S-conjugate transporter
Name:ABC-type glutathione-S-conjugate transporter
Type:PROTEIN
Mol. Mass.:167836.19
Organism:Homo sapiens (Human)
Description:ChEMBL_837732
Residue:1514
BDBM18050
NameBDBM18050
Synonyms:2-[(4-{[(2,4-diaminopteridin-6-yl)methyl](methyl)amino}phenyl)formamido]pentanedioic acid MTX cid_126941
TypeSmall organic molecule
Emp. Form.C20H22N8O5
Mol. Mass.454.4393
SMILESCN(Cc1cnc2nc(N)nc(N)c2n1)c1ccc(cc1)C(=O)N[C@@H](CCC(O)=O)C(O)=O