Reaction Details
TargetATP-binding cassette sub-family C member 2
LigandBDBM50391004
Substrate/Competitorn/a
Meas. Tech.ChEMBL_836184 (CHEMBL2075083)
Ki 34500±n/a nM
Citation Kusuhara, HHan, YHShimoda, MKokue, ESuzuki, HSugiyama, Y Reduced folate derivatives are endogenous substrates for cMOAT in rats. Am J Physiol275:789-96 (1998) 
 
ATP-binding cassette sub-family C member 2
Name:ATP-binding cassette sub-family C member 2
Type:PROTEIN
Mol. Mass.:173415.22
Organism:Rattus norvegicus
Description:ChEMBL_1455464
Residue:1541
BDBM50391004
NameBDBM50391004
Synonyms:CHEMBL213947
TypeSmall organic molecule
Emp. Form.C16H19N5O10S
Mol. Mass.473.415
SMILESN[C@@H](CCC(=O)N[C@H](CSc1ccc(cc1[N+]([O-])=O)[N+]([O-])=O)C(=O)NCC(O)=O)C(O)=O