Reaction Details
Target5-hydroxytryptamine receptor 4
LigandBDBM50388698
Substrate/Competitorn/a
Meas. Tech.ChEMBL_841618 (CHEMBL2092044)
Ki 10±n/a nM
Citation Long, DDArmstrong, SRBeattie, DTChoi, SKFatheree, PRGendron, RAGenov, DGoldblum, AAHumphrey, PPJiang, LMarquess, DGShaw, JPSmith, JATurner, SDVickery, RG Discovery, oral pharmacokinetics and in vivo efficacy of velusetrag, a highly selective 5-HT(4) receptor agonist that has achieved proof-of-concept in patients with chronic idiopathic constipation. Bioorg Med Chem Lett22:6048-52 (2012) 
 
5-hydroxytryptamine receptor 4
Name:5-hydroxytryptamine receptor 4
Type:Enzyme
Mol. Mass.:43767.54
Organism:Homo sapiens (Human)
Description:Q13639
Residue:388
BDBM50388698
NameBDBM50388698
Synonyms:CHEMBL2059590
TypeSmall organic molecule
Emp. Form.C26H38N6O2
Mol. Mass.466.6189
SMILESCC(C)n1nc(C(=O)N[C@@H]2C[C@@H]3CC[C@H](C2)N3CCN2CCN(CC2)C(C)=O)c2ccccc12