Reaction Details
TargetMu-type opioid receptor
LigandBDBM50391586
Substrate/Competitorn/a
Meas. Tech.ChEMBL_850391 (CHEMBL2150811)
Ki 22.25±n/a nM
Citation Ida, YMatsubara, ANemoto, TSaito, MHirayama, SFujii, HNagase, H Synthesis of quinolinomorphinan derivatives as highly selectived opioid receptor ligands. Bioorg Med Chem20:5810-31 (2012) 
 
Mu-type opioid receptor
Name:Mu-type opioid receptor
Type:Enzyme Catalytic Domain
Mol. Mass.:44431.62
Organism:MOUSE
Description:OPIATE Mu OPRM1 MOUSE::P42866
Residue:398
BDBM50391586
NameBDBM50391586
Synonyms:CHEMBL2147931
TypeSmall organic molecule
Emp. Form.C26H29N3O2
Mol. Mass.415.5274
SMILESCN(C)c1cccc2cc3C[C@@]4(O)[C@H]5Cc6ccc(O)cc6[C@@]4(CCN5C)Cc3nc12