Reaction Details
TargetDelta-type opioid receptor
LigandBDBM50391589
Substrate/Competitorn/a
Meas. Tech.ChEMBL_850392 (CHEMBL2150812)
Ki 0.403±n/a nM
Citation Ida, YMatsubara, ANemoto, TSaito, MHirayama, SFujii, HNagase, H Synthesis of quinolinomorphinan derivatives as highly selectived opioid receptor ligands. Bioorg Med Chem20:5810-31 (2012) 
 
Delta-type opioid receptor
Name:Delta-type opioid receptor
Type:Enzyme Catalytic Domain
Mol. Mass.:40577.25
Organism:MOUSE
Description:P32300
Residue:372
BDBM50391589
NameBDBM50391589
Synonyms:CHEMBL2147902
TypeSmall organic molecule
Emp. Form.C24H23ClN2O2
Mol. Mass.406.905
SMILESCN1CC[C@]23Cc4nc5cc(Cl)ccc5cc4C[C@@]2(O)[C@H]1Cc1ccc(O)cc31