Reaction Details
TargetReceptor tyrosine-protein kinase erbB-2
LigandBDBM50391646
Substrate/Competitorn/a
Meas. Tech.ChEMBL_850421 (CHEMBL2150608)
IC50 11±n/a nM
Citation Kawakita, YMiwa, KSeto, MBanno, HOhta, YTamura, TYusa, TMiki, HKamiguchi, HIkeda, YTanaka, TKamiyama, KIshikawa, T Design and synthesis of pyrrolo[3,2-d]pyrimidine HER2/EGFR dual inhibitors: improvement of the physicochemical and pharmacokinetic profiles for potent in vivo anti-tumor efficacy. Bioorg Med Chem20:6171-80 (2012) 
 
Receptor tyrosine-protein kinase erbB-2
Name:Receptor tyrosine-protein kinase erbB-2
Type:n/a
Mol. Mass.:137894.47
Organism:Homo sapiens (Human)
Description:P04626
Residue:1255
BDBM50391646
NameBDBM50391646
Synonyms:CHEMBL2148046
TypeSmall organic molecule
Emp. Form.C26H25ClF3N5O4S
Mol. Mass.596.021
SMILESCC(C)S(=O)(=O)CC(=O)NCCn1ccc2ncnc(Nc3ccc(Oc4cccc(c4)C(F)(F)F)c(Cl)c3)c12