Reaction Details
TargetHepatocyte growth factor receptor
LigandBDBM50391643
Substrate/Competitorn/a
Meas. Tech.ChEMBL_847955 (CHEMBL2150255)
IC50 3900±n/a nM
Citation Kawakita, YMiwa, KSeto, MBanno, HOhta, YTamura, TYusa, TMiki, HKamiguchi, HIkeda, YTanaka, TKamiyama, KIshikawa, T Design and synthesis of pyrrolo[3,2-d]pyrimidine HER2/EGFR dual inhibitors: improvement of the physicochemical and pharmacokinetic profiles for potent in vivo anti-tumor efficacy. Bioorg Med Chem20:6171-80 (2012) 
 
Hepatocyte growth factor receptor
Name:Hepatocyte growth factor receptor
Type:Protein
Mol. Mass.:155559.73
Organism:Homo sapiens (Human)
Description:P08581
Residue:1390
BDBM50391643
NameBDBM50391643
Synonyms:CHEMBL2148052 | CHEMBL2148053
TypeSmall organic molecule
Emp. Form.C25H25Cl2N5O4S
Mol. Mass.562.468
SMILESCC(C)(C(=O)NCCn1ccc2ncnc(Nc3ccc(Oc4cccc(Cl)c4)c(Cl)c3)c12)S(C)(=O)=O