Reaction Details
TargetCalcium/calmodulin-dependent protein kinase type II subunit alpha
LigandBDBM50391730
Substrate/Competitorn/a
Meas. Tech.ChEMBL_848194 (CHEMBL2148930)
IC50 54000±n/a nM
Citation Mayadevi, MSherin, DRKeerthi, VSRajasekharan, KNOmkumar, RV Curcumin is an inhibitor of calcium/calmodulin dependent protein kinase II. Bioorg Med Chem20:6040-7 (2012) 
 
Calcium/calmodulin-dependent protein kinase type II subunit alpha
Name:Calcium/calmodulin-dependent protein kinase type II subunit alpha
Type:Enzyme Catalytic Domain
Mol. Mass.:54093.63
Organism:Homo sapiens (Human)
Description:gi_25952118
Residue:478
BDBM50391730
NameBDBM50391730
Synonyms:CHEMBL258741
TypeSmall organic molecule
Emp. Form.C27H24N2O4
Mol. Mass.440.4905
SMILESCOc1cc(\C=C\c2cc(\C=C\c3ccc(O)c(OC)c3)n(n2)-c2ccccc2)ccc1O