Reaction Details
TargetCalcium/calmodulin-dependent protein kinase type II subunit alpha
LigandBDBM50163745
Substrate/Competitorn/a
Meas. Tech.ChEMBL_848195 (CHEMBL2148931)
IC50 24440±n/a nM
Citation Mayadevi, MSherin, DRKeerthi, VSRajasekharan, KNOmkumar, RV Curcumin is an inhibitor of calcium/calmodulin dependent protein kinase II. Bioorg Med Chem20:6040-7 (2012) 
 
Calcium/calmodulin-dependent protein kinase type II subunit alpha
Name:Calcium/calmodulin-dependent protein kinase type II subunit alpha
Type:Enzyme Catalytic Domain
Mol. Mass.:54093.63
Organism:Homo sapiens (Human)
Description:gi_25952118
Residue:478
BDBM50163745
NameBDBM50163745
Synonyms:4,40-(1E,10E)-2,20-(Isoxazole-3,5-diyl)bis(ethene-2,1-diyl)bis(2-methoxyphenol) 4-(-2-(5-(4-hydroxy-3-methoxystyryl)isoxazol-3-yl)vinyl)-2-methoxyphenol CHEMBL181529
TypeSmall organic molecule
Emp. Form.C21H19NO5
Mol. Mass.365.3793
SMILESCOc1cc(\C=C\c2cc(\C=C\c3ccc(O)c(OC)c3)on2)ccc1O