Reaction Details
TargetFatty acid synthase
LigandBDBM50391838
Substrate/Competitorn/a
Meas. Tech.ChEMBL_850469 (CHEMBL2150656)
IC50 6±n/a nM
Citation Abdel-Magid, AF Fatty Acid synthase inhibitors as possible treatment for cancer: patent highlight. ACS Med Chem Lett3:612-613 (2012) 
 
Fatty acid synthase
Name:Fatty acid synthase
Type:Enzyme
Mol. Mass.:273419.37
Organism:Homo sapiens (Human)
Description:P49327
Residue:2511
BDBM50391838
NameBDBM50391838
Synonyms:CHEMBL2147033
TypeSmall organic molecule
Emp. Form.C26H27N3O4S
Mol. Mass.477.575
SMILESO=C1COC2(CCN(CC2)S(=O)(=O)c2ccc(cc2)-c2ccc3cnccc3c2)CN1C1CC1