Reaction Details
TargetGlucocorticoid receptor
LigandBDBM50391916
Substrate/Competitorn/a
Meas. Tech.ChEMBL_849777 (CHEMBL2150559)
Ki 1±n/a nM
Citation Bungard, CJHartman, GDManikowski, JJPerkins, JJBai, CBrandish, PEEuler, DHHershey, JCSchmidt, AFang, YNorcross, RTRushmore, THThompson, CDMeissner, RS Discovery of selective glucocorticoid receptor modulator MK-5932. Bioorg Med Chem19:7374-86 (2011) 
 
Glucocorticoid receptor
Name:Glucocorticoid receptor
Type:Enzyme
Mol. Mass.:85656.87
Organism:Homo sapiens (Human)
Description:P04150
Residue:777
BDBM50391916
NameBDBM50391916
Synonyms:CHEMBL2147556
TypeSmall organic molecule
Emp. Form.C29H30FN3O2
Mol. Mass.471.5658
SMILESC[C@]12Cc3cnn(c3C=C1CC[C@@]2(O)CCc1ccccc1C(=O)NCC=C)-c1ccc(F)cc1