Reaction Details
TargetGlucocorticoid receptor
LigandBDBM50391918
Substrate/Competitorn/a
Meas. Tech.ChEMBL_849777 (CHEMBL2150559)
Ki 4±n/a nM
Citation Bungard, CJHartman, GDManikowski, JJPerkins, JJBai, CBrandish, PEEuler, DHHershey, JCSchmidt, AFang, YNorcross, RTRushmore, THThompson, CDMeissner, RS Discovery of selective glucocorticoid receptor modulator MK-5932. Bioorg Med Chem19:7374-86 (2011) 
 
Glucocorticoid receptor
Name:Glucocorticoid receptor
Type:Enzyme
Mol. Mass.:85656.87
Organism:Homo sapiens (Human)
Description:P04150
Residue:777
BDBM50391918
NameBDBM50391918
Synonyms:CHEMBL2147558
TypeSmall organic molecule
Emp. Form.C29H32FN3O2
Mol. Mass.473.5817
SMILESCC(C)NC(=O)c1ccccc1CC[C@]1(O)CCC2=Cc3c(C[C@]12C)cnn3-c1ccc(F)cc1