Reaction Details
TargetGlucocorticoid receptor
LigandBDBM50391924
Substrate/Competitorn/a
Meas. Tech.ChEMBL_849777 (CHEMBL2150559)
Ki 3±n/a nM
Citation Bungard, CJHartman, GDManikowski, JJPerkins, JJBai, CBrandish, PEEuler, DHHershey, JCSchmidt, AFang, YNorcross, RTRushmore, THThompson, CDMeissner, RS Discovery of selective glucocorticoid receptor modulator MK-5932. Bioorg Med Chem19:7374-86 (2011) 
 
Glucocorticoid receptor
Name:Glucocorticoid receptor
Type:Enzyme
Mol. Mass.:85656.87
Organism:Homo sapiens (Human)
Description:P04150
Residue:777
BDBM50391924
NameBDBM50391924
Synonyms:CHEMBL2147567
TypeSmall organic molecule
Emp. Form.C30H31F2N3O3
Mol. Mass.519.5822
SMILESC[C@]12Cc3cnn(c3C=C1CC[C@@]2(O)CCc1cccc(F)c1C(=O)NC1(CO)CC1)-c1ccc(F)cc1