Reaction Details
TargetTyrosine-protein kinase JAK1
LigandBDBM50392010
Substrate/Competitorn/a
Meas. Tech.ChEMBL_851246 (CHEMBL2155758)
Ki 2.9±n/a nM
Citation Kulagowski, JJBlair, WBull, RJChang, CDeshmukh, GDyke, HJEigenbrot, CGhilardi, NGibbons, PHarrison, TKHewitt, PRLiimatta, MHurley, CAJohnson, AJohnson, TKenny, JRBir Kohli, PMaxey, RJMendonca, RMortara, KMurray, JNarukulla, RShia, SSteffek, MUbhayakar, SUltsch, Mvan Abbema, AWard, SIWaszkowycz, BZak, M Identification of imidazo-pyrrolopyridines as novel and potent JAK1 inhibitors. J Med Chem55:5901-21 (2012) 
 
Tyrosine-protein kinase JAK1
Name:Tyrosine-protein kinase JAK1
Type:Protein
Mol. Mass.:133293.73
Organism:Homo sapiens (Human)
Description:P23458
Residue:1154
BDBM50392010
NameBDBM50392010
Synonyms:CHEMBL2152400
TypeSmall organic molecule
Emp. Form.C15H16F3N5
Mol. Mass.323.3162
SMILESFC(F)(F)CN1CCC(CC1)n1cnc2cnc3[nH]ccc3c12