Reaction Details
TargetProthrombin
LigandBDBM50324477
Substrate/Competitorn/a
Meas. Tech.ChEMBL_851263 (CHEMBL2155775)
Ki 0.119±n/a nM
Citation Biela, ASielaff, FTerwesten, FHeine, ASteinmetzer, TKlebe, G Ligand binding stepwise disrupts water network in thrombin: enthalpic and entropic changes reveal classical hydrophobic effect. J Med Chem55:6094-110 (2012) 
 
Prothrombin
Name:Prothrombin
Type:Protein
Mol. Mass.:70029.57
Organism:Homo sapiens (Human)
Description:P00734
Residue:622
BDBM50324477
NameBDBM50324477
Synonyms:Benzylsulfonyl-D-cyclohexylalanyl-proline-(4-amidinobenzyl)-amide Trifluoroacetate CHEMBL1229261
TypeSmall organic molecule
Emp. Form.C29H39N5O4S
Mol. Mass.553.716
SMILESNC(=N)c1ccc(CNC(=O)[C@@H]2CCCN2C(=O)[C@@H](CC2CCCCC2)NS(=O)(=O)Cc2ccccc2)cc1