Reaction Details
TargetNAD-dependent protein deacetylase sirtuin-2
LigandBDBM50392066
Substrate/Competitorn/a
Meas. Tech.ChEMBL_851437 (CHEMBL2156443)
IC50 93000±n/a nM
Citation Suzuki, TKhan, MNSawada, HImai, EItoh, YYamatsuta, KTokuda, NTakeuchi, JSeko, TNakagawa, HMiyata, N Design, synthesis, and biological activity of a novel series of human sirtuin-2-selective inhibitors. J Med Chem55:5760-73 (2012) 
 
NAD-dependent protein deacetylase sirtuin-2
Name:NAD-dependent protein deacetylase sirtuin-2
Type:Hydrolase
Mol. Mass.:43172.62
Organism:Homo sapiens (Human)
Description:n/a
Residue:389
BDBM50392066
NameBDBM50392066
Synonyms:CHEMBL2152570
TypeSmall organic molecule
Emp. Form.C17H18N2O3
Mol. Mass.298.3364
SMILESCOC(=O)CCc1cccc(Nc2ccccc2C(N)=O)c1