Reaction Details
TargetNAD-dependent protein deacetylase sirtuin-2
LigandBDBM50392090
Substrate/Competitorn/a
Meas. Tech.ChEMBL_851437 (CHEMBL2156443)
IC50 23000±n/a nM
Citation Suzuki, TKhan, MNSawada, HImai, EItoh, YYamatsuta, KTokuda, NTakeuchi, JSeko, TNakagawa, HMiyata, N Design, synthesis, and biological activity of a novel series of human sirtuin-2-selective inhibitors. J Med Chem55:5760-73 (2012) 
 
NAD-dependent protein deacetylase sirtuin-2
Name:NAD-dependent protein deacetylase sirtuin-2
Type:Hydrolase
Mol. Mass.:43172.62
Organism:Homo sapiens (Human)
Description:n/a
Residue:389
BDBM50392090
NameBDBM50392090
Synonyms:CHEMBL2152592
TypeSmall organic molecule
Emp. Form.C20H17N3O2
Mol. Mass.331.3679
SMILESNC(=O)c1ccccc1Nc1ccc(cc1)C(=O)Nc1ccccc1