Reaction Details
TargetNAD-dependent protein deacetylase sirtuin-2
LigandBDBM50392094
Substrate/Competitorn/a
Meas. Tech.ChEMBL_851437 (CHEMBL2156443)
IC50>100000±n/a nM
Citation Suzuki, TKhan, MNSawada, HImai, EItoh, YYamatsuta, KTokuda, NTakeuchi, JSeko, TNakagawa, HMiyata, N Design, synthesis, and biological activity of a novel series of human sirtuin-2-selective inhibitors. J Med Chem55:5760-73 (2012) 
 
NAD-dependent protein deacetylase sirtuin-2
Name:NAD-dependent protein deacetylase sirtuin-2
Type:Hydrolase
Mol. Mass.:43172.62
Organism:Homo sapiens (Human)
Description:n/a
Residue:389
BDBM50392094
NameBDBM50392094
Synonyms:CHEMBL2152596
TypeSmall organic molecule
Emp. Form.C17H19N3O2
Mol. Mass.297.3517
SMILESCC(C)C(=O)Nc1ccc(Nc2ccccc2C(N)=O)cc1