Reaction Details
TargetNAD-dependent protein deacetylase sirtuin-1
LigandBDBM50392093
Substrate/Competitorn/a
Meas. Tech.ChEMBL_851435 (CHEMBL2156441)
IC50>100000±n/a nM
Citation Suzuki, TKhan, MNSawada, HImai, EItoh, YYamatsuta, KTokuda, NTakeuchi, JSeko, TNakagawa, HMiyata, N Design, synthesis, and biological activity of a novel series of human sirtuin-2-selective inhibitors. J Med Chem55:5760-73 (2012) 
 
NAD-dependent protein deacetylase sirtuin-1
Name:NAD-dependent protein deacetylase sirtuin-1
Type:Developmental protein; hydrolase
Mol. Mass.:81626.66
Organism:Homo sapiens (Human)
Description:n/a
Residue:747
BDBM50392093
NameBDBM50392093
Synonyms:CHEMBL2152595
TypeSmall organic molecule
Emp. Form.C15H15N3O2
Mol. Mass.269.2985
SMILESCC(=O)Nc1ccc(Nc2ccccc2C(N)=O)cc1