Reaction Details
TargetAsparagine synthetase [glutamine-hydrolyzing]
LigandBDBM50378579
Substrate/Competitorn/a
Meas. Tech.ChEMBL_851326 (CHEMBL2156033)
Ki 24±n/a nM
Citation Ikeuchi, HAhn, YMOtokawa, TWatanabe, BHegazy, LHiratake, JRichards, NG A sulfoximine-based inhibitor of human asparagine synthetase kills L-asparaginase-resistant leukemia cells. Bioorg Med Chem20:5915-27 (2012) 
 
Asparagine synthetase [glutamine-hydrolyzing]
Name:Asparagine synthetase [glutamine-hydrolyzing]
Type:PROTEIN
Mol. Mass.:64373.20
Organism:Homo sapiens (Human)
Description:ChEMBL_851327
Residue:561
BDBM50378579
NameBDBM50378579
Synonyms:CHEMBL1627258
TypeSmall organic molecule
Emp. Form.C14H22N7O9PS
Mol. Mass.495.405
SMILESCS(=O)(CC(=N)C(O)=O)NP(O)(=O)OC[C@H]1O[C@H]([C@H](O)[C@@H]1O)n1cnc2c(N)ncnc12