Reaction Details
TargetCannabinoid receptor 2
LigandBDBM50392307
Substrate/Competitorn/a
Meas. Tech.ChEMBL_851481 (CHEMBL2156597)
IC50>5000±n/a nM
Citation Chorvat, RJBerbaum, JSeriacki, KMcElroy, JF JD-5006 and JD-5037: peripherally restricted (PR) cannabinoid-1 receptor blockers related to SLV-319 (Ibipinabant) as metabolic disorder therapeutics devoid of CNS liabilities. Bioorg Med Chem Lett22:6173-80 (2012) 
 
Cannabinoid receptor 2
Name:Cannabinoid receptor 2
Type:G Protein-Coupled Receptor (GPCR)
Mol. Mass.:39690.94
Organism:Homo sapiens (Human)
Description:P34972
Residue:360
BDBM50392307
NameBDBM50392307
Synonyms:CHEMBL2153668
TypeSmall organic molecule
Emp. Form.C31H27Cl2N5O3S
Mol. Mass.620.549
SMILESNC(=O)[C@H](Cc1ccccc1)N=C(NS(=O)(=O)c1ccc(Cl)cc1)N1CC(C(=N1)c1ccc(Cl)cc1)c1ccccc1