Reaction Details
TargetCannabinoid receptor 1
LigandBDBM50392293
Substrate/Competitorn/a
Meas. Tech.ChEMBL_851480 (CHEMBL2156596)
IC50>500±n/a nM
Citation Chorvat, RJBerbaum, JSeriacki, KMcElroy, JF JD-5006 and JD-5037: peripherally restricted (PR) cannabinoid-1 receptor blockers related to SLV-319 (Ibipinabant) as metabolic disorder therapeutics devoid of CNS liabilities. Bioorg Med Chem Lett22:6173-80 (2012) 
 
Cannabinoid receptor 1
Name:Cannabinoid receptor 1
Type:G Protein-Coupled Receptor (GPCR)
Mol. Mass.:52868.96
Organism:Homo sapiens (Human)
Description:P21554
Residue:472
BDBM50392293
NameBDBM50392293
Synonyms:CHEMBL2153762
TypeSmall organic molecule
Emp. Form.C25H24ClN5O4S
Mol. Mass.526.007
SMILESC[C@H](N=C(NS(=O)(=O)c1ccc(O)cc1)N1CC(C(=N1)c1ccc(Cl)cc1)c1ccccc1)C(N)=O