Reaction Details
TargetCannabinoid receptor 1
LigandBDBM50392295
Substrate/Competitorn/a
Meas. Tech.ChEMBL_851480 (CHEMBL2156596)
IC50 25±n/a nM
Citation Chorvat, RJBerbaum, JSeriacki, KMcElroy, JF JD-5006 and JD-5037: peripherally restricted (PR) cannabinoid-1 receptor blockers related to SLV-319 (Ibipinabant) as metabolic disorder therapeutics devoid of CNS liabilities. Bioorg Med Chem Lett22:6173-80 (2012) 
 
Cannabinoid receptor 1
Name:Cannabinoid receptor 1
Type:G Protein-Coupled Receptor (GPCR)
Mol. Mass.:52868.96
Organism:Homo sapiens (Human)
Description:P21554
Residue:472
BDBM50392295
NameBDBM50392295
Synonyms:CHEMBL2153764
TypeSmall organic molecule
Emp. Form.C26H24Cl2N6O4S
Mol. Mass.587.478
SMILESNC(=O)CNC(=O)CN=C(NS(=O)(=O)c1ccc(Cl)cc1)N1CC(C(=N1)c1ccc(Cl)cc1)c1ccccc1