Reaction Details
TargetKiSS-1 receptor
LigandBDBM50392403
Substrate/Competitorn/a
Meas. Tech.ChEMBL_851680 (CHEMBL2155897)
EC50 0.62±n/a nM
Citation Asami, TNishizawa, NIshibashi, YNishibori, KNakayama, MHorikoshi, YMatsumoto, SYamaguchi, MMatsumoto, HTarui, NOhtaki, TKitada, C Serum stability of selected decapeptide agonists of KISS1R using pseudopeptides. Bioorg Med Chem Lett22:6391-6 (2012) 
 
KiSS-1 receptor
Name:KiSS-1 receptor
Type:G Protein-Coupled Receptor (GPCR)
Mol. Mass.:42613.79
Organism:Homo sapiens (Human)
Description:Binding assay was performed using membranes from the CHO cell transfectants.
Residue:398
BDBM50392403
NameBDBM50392403
Synonyms:CHEMBL2151644
TypeSmall organic molecule
Emp. Form.C64H87N17O13
Mol. Mass.1302.4817
SMILESCNC(N)=NCCC[C@H](NC(=O)[C@H](CC(C)C)NC(=O)CNC[C@H](Cc1ccccc1)NC(=O)[C@H](CO)NC(=O)[C@H](CC(N)=O)NC(=O)[C@H](Cc1c[nH]c2ccccc12)NC(=O)[C@H](CC(N)=O)NC(=O)[C@H](N)Cc1ccc(O)cc1)C(=O)N[C@@H](Cc1ccccc1)C(N)=O