Reaction Details
TargetMetabotropic glutamate receptor 5
LigandBDBM50337958
Substrate/Competitorn/a
Meas. Tech.ChEMBL_851727 (CHEMBL2156069)
EC50 16±n/a nM
Citation Manka, JTVinson, PNGregory, KJZhou, YWilliams, RGogi, KDays, EJadhav, SHerman, EJLavreysen, HMackie, CBartolomé, JMMacdonald, GJSteckler, TDaniels, JSWeaver, CDNiswender, CMJones, CKConn, PJLindsley, CWStauffer, SR Optimization of an ether series of mGlu5 positive allosteric modulators: molecular determinants of MPEP-site interaction crossover. Bioorg Med Chem Lett22:6481-5 (2012) 
 
Metabotropic glutamate receptor 5
Name:Metabotropic glutamate receptor 5
Type:Enzyme
Mol. Mass.:131900.14
Organism:Rattus norvegicus (Rat)
Description:P31424
Residue:1203
BDBM50337958
NameBDBM50337958
Synonyms:CHEMBL1684242 | N-cyclobutyl-6-((3-fluorophenyl)ethynyl)nicotinamide
TypeSmall organic molecule
Emp. Form.C18H15FN2O
Mol. Mass.294.3229
SMILESFc1cccc(c1)C#Cc1ccc(cn1)C(=O)NC1CCC1