Reaction Details
TargetCannabinoid receptor 1
LigandBDBM50392576
Substrate/Competitorn/a
Meas. Tech.ChEMBL_854393 (CHEMBL2154764)
Ki 12.9±n/a nM
Citation Pasquini, SDe Rosa, MLigresti, AMugnaini, CBrizzi, ACaradonna, NPCascio, MGBolognini, DPertwee, RGDi Marzo, VCorelli, F Investigations on the 4-quinolone-3-carboxylic acid motif. 6. Synthesis and pharmacological evaluation of 7-substituted quinolone-3-carboxamide derivatives as high affinity ligands for cannabinoid receptors. Eur J Med Chem58:30-43 (2012) 
 
Cannabinoid receptor 1
Name:Cannabinoid receptor 1
Type:G Protein-Coupled Receptor (GPCR)
Mol. Mass.:52868.96
Organism:Homo sapiens (Human)
Description:P21554
Residue:472
BDBM50392576
NameBDBM50392576
Synonyms:CHEMBL2152827
TypeSmall organic molecule
Emp. Form.C28H28N2O3S
Mol. Mass.472.599
SMILESCCCCCn1cc(C(=O)NOCc2ccccc2)c(=O)c2ccc(Sc3ccccc3)cc12