Reaction Details
TargetCannabinoid receptor 1
LigandBDBM50392580
Substrate/Competitorn/a
Meas. Tech.ChEMBL_854393 (CHEMBL2154764)
Ki>10000±n/a nM
Citation Pasquini, SDe Rosa, MLigresti, AMugnaini, CBrizzi, ACaradonna, NPCascio, MGBolognini, DPertwee, RGDi Marzo, VCorelli, F Investigations on the 4-quinolone-3-carboxylic acid motif. 6. Synthesis and pharmacological evaluation of 7-substituted quinolone-3-carboxamide derivatives as high affinity ligands for cannabinoid receptors. Eur J Med Chem58:30-43 (2012) 
 
Cannabinoid receptor 1
Name:Cannabinoid receptor 1
Type:G Protein-Coupled Receptor (GPCR)
Mol. Mass.:52868.96
Organism:Homo sapiens (Human)
Description:P21554
Residue:472
BDBM50392580
NameBDBM50392580
Synonyms:CHEMBL2152831
TypeSmall organic molecule
Emp. Form.C21H19ClFN3O2
Mol. Mass.399.846
SMILESFc1ccc2c(c1)n(cc(C(=O)NN1CCCCC1)c2=O)-c1ccc(Cl)cc1