Reaction Details
TargetCannabinoid receptor 2
LigandBDBM50392561
Substrate/Competitorn/a
Meas. Tech.ChEMBL_854395 (CHEMBL2154766)
Ki 0.09±n/a nM
Citation Pasquini, SDe Rosa, MLigresti, AMugnaini, CBrizzi, ACaradonna, NPCascio, MGBolognini, DPertwee, RGDi Marzo, VCorelli, F Investigations on the 4-quinolone-3-carboxylic acid motif. 6. Synthesis and pharmacological evaluation of 7-substituted quinolone-3-carboxamide derivatives as high affinity ligands for cannabinoid receptors. Eur J Med Chem58:30-43 (2012) 
 
Cannabinoid receptor 2
Name:Cannabinoid receptor 2
Type:G Protein-Coupled Receptor (GPCR)
Mol. Mass.:39690.94
Organism:Homo sapiens (Human)
Description:P34972
Residue:360
BDBM50392561
NameBDBM50392561
Synonyms:CHEMBL2152813
TypeSmall organic molecule
Emp. Form.C31H38N2O2S
Mol. Mass.502.711
SMILESCCCCCn1cc(C(=O)N[C@@H]2C(C)(C)C3CC[C@]2(C)C3)c(=O)c2ccc(Sc3ccccc3)cc12