Reaction Details
TargetCannabinoid receptor 2
LigandBDBM50392564
Substrate/Competitorn/a
Meas. Tech.ChEMBL_854395 (CHEMBL2154766)
Ki 1.1±n/a nM
Citation Pasquini, SDe Rosa, MLigresti, AMugnaini, CBrizzi, ACaradonna, NPCascio, MGBolognini, DPertwee, RGDi Marzo, VCorelli, F Investigations on the 4-quinolone-3-carboxylic acid motif. 6. Synthesis and pharmacological evaluation of 7-substituted quinolone-3-carboxamide derivatives as high affinity ligands for cannabinoid receptors. Eur J Med Chem58:30-43 (2012) 
 
Cannabinoid receptor 2
Name:Cannabinoid receptor 2
Type:G Protein-Coupled Receptor (GPCR)
Mol. Mass.:39690.94
Organism:Homo sapiens (Human)
Description:P34972
Residue:360
BDBM50392564
NameBDBM50392564
Synonyms:CHEMBL2152816
TypeSmall organic molecule
Emp. Form.C29H34N2O3S
Mol. Mass.490.657
SMILESCOCCn1cc(C(=O)N[C@H]2[C@]3(C)CCC(C3)C2(C)C)c(=O)c2ccc(Sc3ccccc3)cc12