Reaction Details
TargetCannabinoid receptor 2
LigandBDBM50392565
Substrate/Competitorn/a
Meas. Tech.ChEMBL_854395 (CHEMBL2154766)
Ki 6.5±n/a nM
Citation Pasquini, SDe Rosa, MLigresti, AMugnaini, CBrizzi, ACaradonna, NPCascio, MGBolognini, DPertwee, RGDi Marzo, VCorelli, F Investigations on the 4-quinolone-3-carboxylic acid motif. 6. Synthesis and pharmacological evaluation of 7-substituted quinolone-3-carboxamide derivatives as high affinity ligands for cannabinoid receptors. Eur J Med Chem58:30-43 (2012) 
 
Cannabinoid receptor 2
Name:Cannabinoid receptor 2
Type:G Protein-Coupled Receptor (GPCR)
Mol. Mass.:39690.94
Organism:Homo sapiens (Human)
Description:P34972
Residue:360
BDBM50392565
NameBDBM50392565
Synonyms:CHEMBL2152817
TypeSmall organic molecule
Emp. Form.C36H40N2O2S2
Mol. Mass.596.845
SMILESCC1(C)C2CC[C@](C)(C2)[C@@H]1NC(=O)c1cn(CCCCSc2ccccc2)c2cc(Sc3ccccc3)ccc2c1=O