Reaction Details
TargetCannabinoid receptor 2
LigandBDBM50392567
Substrate/Competitorn/a
Meas. Tech.ChEMBL_854395 (CHEMBL2154766)
Ki 957.1±n/a nM
Citation Pasquini, SDe Rosa, MLigresti, AMugnaini, CBrizzi, ACaradonna, NPCascio, MGBolognini, DPertwee, RGDi Marzo, VCorelli, F Investigations on the 4-quinolone-3-carboxylic acid motif. 6. Synthesis and pharmacological evaluation of 7-substituted quinolone-3-carboxamide derivatives as high affinity ligands for cannabinoid receptors. Eur J Med Chem58:30-43 (2012) 
 
Cannabinoid receptor 2
Name:Cannabinoid receptor 2
Type:G Protein-Coupled Receptor (GPCR)
Mol. Mass.:39690.94
Organism:Homo sapiens (Human)
Description:P34972
Residue:360
BDBM50392567
NameBDBM50392567
Synonyms:CHEMBL2151057
TypeSmall organic molecule
Emp. Form.C20H23FN2O2
Mol. Mass.342.4072
SMILESCC1(C)C2CC[C@](C)(C2)[C@@H]1NC(=O)c1cnc2cc(F)ccc2c1O