Reaction Details
TargetCannabinoid receptor 2
LigandBDBM50392568
Substrate/Competitorn/a
Meas. Tech.ChEMBL_854395 (CHEMBL2154766)
Ki>10000±n/a nM
Citation Pasquini, SDe Rosa, MLigresti, AMugnaini, CBrizzi, ACaradonna, NPCascio, MGBolognini, DPertwee, RGDi Marzo, VCorelli, F Investigations on the 4-quinolone-3-carboxylic acid motif. 6. Synthesis and pharmacological evaluation of 7-substituted quinolone-3-carboxamide derivatives as high affinity ligands for cannabinoid receptors. Eur J Med Chem58:30-43 (2012) 
 
Cannabinoid receptor 2
Name:Cannabinoid receptor 2
Type:G Protein-Coupled Receptor (GPCR)
Mol. Mass.:39690.94
Organism:Homo sapiens (Human)
Description:P34972
Residue:360
BDBM50392568
NameBDBM50392568
Synonyms:CHEMBL2152819
TypeSmall organic molecule
Emp. Form.C28H26Cl2N2O2
Mol. Mass.493.424
SMILESCCCCCn1cc(C(=O)NCc2ccc(Cl)c(Cl)c2)c(=O)c2ccc(cc12)-c1ccccc1