Reaction Details
TargetAlpha-1D adrenergic receptor
LigandBDBM50392639
Substrate/Competitorn/a
Meas. Tech.ChEMBL_854044 (CHEMBL2155385)
Ki 8.91±n/a nM
Citation Fumagalli, LPallavicini, MBudriesi, RGobbi, MStraniero, VZagami, MChiodini, GBolchi, CChiarini, AMicucci, MValoti, E Affinity and activity profiling of unichiral 8-substituted 1,4-benzodioxane analogues of WB4101 reveals a potent and selectivea1B-adrenoceptor antagonist. Eur J Med Chem58:184-91 (2012) 
 
Alpha-1D adrenergic receptor
Name:Alpha-1D adrenergic receptor
Type:Enzyme Catalytic Domain
Mol. Mass.:60485.82
Organism:Homo sapiens (Human)
Description:adrenergic Alpha1D ADRA1D HUMAN::P25100
Residue:572
BDBM50392639
NameBDBM50392639
Synonyms:CHEMBL2153551
TypeSmall organic molecule
Emp. Form.C19H23NO6
Mol. Mass.361.389
SMILESCOc1cccc(OC)c1OCCNC[C@H]1COc2cccc(O)c2O1