Reaction Details
TargetHistamine H3 receptor
LigandBDBM50370569
Substrate/Competitorn/a
Meas. Tech.ChEMBL_853238 (CHEMBL2154939)
Ki 1.58±n/a nM
Citation Berlin, MBoyce, CWRuiz Mde, L Histamine H3 receptor as a drug discovery target. J Med Chem54:26-53 (2011) 
 
Histamine H3 receptor
Name:Histamine H3 receptor
Type:G Protein-Coupled Receptor (GPCR)
Mol. Mass.:48691.47
Organism:Homo sapiens (Human)
Description:Binding assays were using CHO cells stably expressing hH3R receptors.
Residue:445
BDBM50370569
NameBDBM50370569
Synonyms:A-349,821 | A-349821
TypeSmall organic molecule
Emp. Form.C26H34N2O3
Mol. Mass.422.5598
SMILESC[C@H]1CC[C@H](C)N1CCCOc1ccc(cc1)-c1ccc(cc1)C(=O)N1CCOCC1