Reaction Details
TargetHistamine H3 receptor
LigandBDBM50247054
Substrate/Competitorn/a
Meas. Tech.ChEMBL_853237 (CHEMBL2154938)
Ki 0.631±n/a nM
Citation Berlin, MBoyce, CWRuiz Mde, L Histamine H3 receptor as a drug discovery target. J Med Chem54:26-53 (2011) 
 
Histamine H3 receptor
Name:Histamine H3 receptor
Type:G Protein-Coupled Receptor (GPCR)
Mol. Mass.:48607.98
Organism:Rattus norvegicus (rat)
Description:n/a
Residue:445
BDBM50247054
NameBDBM50247054
Synonyms:6-(3-cyclobutyl-2,3,4,5-tetrahydro-1H-benzo[d]azepin-7-yloxy)-N-methylnicotinamide GSK-189254
TypeSmall organic molecule
Emp. Form.C21H25N3O2
Mol. Mass.351.4421
SMILESCNC(=O)c1ccc(Oc2ccc3CCN(CCc3c2)C2CCC2)nc1