Reaction Details
TargetHistamine H3 receptor
LigandBDBM50346209
Substrate/Competitorn/a
Meas. Tech.ChEMBL_853249 (CHEMBL2154950)
IC50 0.631±n/a nM
Citation Berlin, MBoyce, CWRuiz Mde, L Histamine H3 receptor as a drug discovery target. J Med Chem54:26-53 (2011) 
 
Histamine H3 receptor
Name:Histamine H3 receptor
Type:G Protein-Coupled Receptor (GPCR)
Mol. Mass.:48691.47
Organism:Homo sapiens (Human)
Description:Binding assays were using CHO cells stably expressing hH3R receptors.
Residue:445
BDBM50346209
NameBDBM50346209
Synonyms:5-(3-cyclobutyl-2,3,4,5-tetrahydro-1H-benzo[d]azepin-7-yloxy)-N-methylpyrazine-2-carboxamide | CHEMBL1783890
TypeSmall organic molecule
Emp. Form.C20H24N4O2
Mol. Mass.352.4302
SMILESCNC(=O)c1cnc(Oc2ccc3CCN(CCc3c2)C2CCC2)cn1