Reaction Details
TargetHistamine H3 receptor
LigandBDBM50139391
Substrate/Competitorn/a
Meas. Tech.ChEMBL_853237 (CHEMBL2154938)
Ki 0.45±n/a nM
Citation Berlin, MBoyce, CWRuiz Mde, L Histamine H3 receptor as a drug discovery target. J Med Chem54:26-53 (2011) 
 
Histamine H3 receptor
Name:Histamine H3 receptor
Type:G Protein-Coupled Receptor (GPCR)
Mol. Mass.:48607.98
Organism:Rattus norvegicus (rat)
Description:n/a
Residue:445
BDBM50139391
NameBDBM50139391
Synonyms:(R)-4-(2-(2-(2-methylpyrrolidin-1-yl)ethyl)benzofuran-5-yl)benzonitrile ABT-239 | CHEMBL351231
TypeSmall organic molecule
Emp. Form.C22H22N2O
Mol. Mass.330.4229
SMILESC[C@@H]1CCCN1CCc1cc2cc(ccc2o1)-c1ccc(cc1)C#N