Reaction Details
TargetHistamine H3 receptor
LigandBDBM50146835
Substrate/Competitorn/a
Meas. Tech.ChEMBL_853238 (CHEMBL2154939)
Ki 1.2±n/a nM
Citation Berlin, MBoyce, CWRuiz Mde, L Histamine H3 receptor as a drug discovery target. J Med Chem54:26-53 (2011) 
 
Histamine H3 receptor
Name:Histamine H3 receptor
Type:G Protein-Coupled Receptor (GPCR)
Mol. Mass.:48691.47
Organism:Homo sapiens (Human)
Description:Binding assays were using CHO cells stably expressing hH3R receptors.
Residue:445
BDBM50146835
NameBDBM50146835
Synonyms:1-(4-Chloro-phenyl)-4-(4-cyclopentyl-piperazin-1-yl)-butane-1,4-dione; hydrochloride | CHEMBL97170
TypeSmall organic molecule
Emp. Form.C19H25ClN2O2
Mol. Mass.348.867
SMILESClc1ccc(cc1)C(=O)CCC(=O)N1CCN(CC1)C1CCCC1