Reaction Details
TargetSodium channel protein type 9 subunit alpha
LigandBDBM50393017
Substrate/Competitorn/a
Meas. Tech.ChEMBL_853578 (CHEMBL2153996)
Ki 130±n/a nM
Citation Blass, B Substituted pyridines as sodium channel blockers: patent highlight. ACS Med Chem Lett3:695-696 (2012) 
 
Sodium channel protein type 9 subunit alpha
Name:Sodium channel protein type 9 subunit alpha
Type:Protein
Mol. Mass.:226375.97
Organism:Homo sapiens (Human)
Description:Q15858
Residue:1988
BDBM50393017
NameBDBM50393017
Synonyms:CHEMBL2152682 | US9656959, Example 4
TypeSmall organic molecule
Emp. Form.C28H24FN3O3
Mol. Mass.469.5069
SMILESCC(=O)N[C@@H](Cc1ccccc1)C(=O)Nc1cccc(n1)-c1ccc(Oc2ccc(F)cc2)cc1